{"text_format":"1","workbook":"xlsx","n_sheets":24,"sheets":["For GFSC Portal Use Only","Explanatory Note GB","Explanatory Note LTB","Validation Summary LTB","Validation Summary GB","Change Log LTB","Change Log GB","Validation Summary Cat6","Validation Summary Non-Standard","Undertaking Information","Summary GB","Balance Sheet Non-standard","Summary LTB","Balance Sheet LTB","Balance Sheet GB","Market Risk LTB","Market Risk GB","Default Risk LTB","Default Risk GB","Premium Risk","Reserve Risk","Under'g Risk LTB","Factors","Balance Sheet Cat6"],"not_rendered":{"charts":8,"images":3,"macros":1,"external_links":0,"defined_names":35,"comments":0,"pivot_tables":0},"unopened":[],"bounds":{"document_bytes":16777216,"sheet_cells":100000,"rows_first":2000,"rows_last":500,"rows_between":2000,"halvings":0,"cell_chars":16384,"cell_head_chars":4096},"cells_cut":0,"cells_raw":0,"read":"whole","date_system":"1900"}

{"sheet":"For GFSC Portal Use Only","index":0,"n_rows":27,"n_cols":10,"rows_kept":27,"cut":false,"hidden":true,"merged":[]}
[null,"Form Name","RSA","Name"]
[null,"Form Version","v2.0","Vn.n"]
[]
[null,"Licensee Name",{"$f":"IF('Undertaking Information'!H19=\"Cell\",Cell_Name,Undertaking_Name)","v":0}]
[null,"Name Reference",{"$f":"'Undertaking Information'!D29","v":0}]
[null,"Frequency","A","M,Q,A"]
[]
[null,"Reporting Date",{"$f":"Assessment_Date","v":"00:00:00"},"MONTH YYYY"]
{"$rows_left_out":20}
{"sheet":"Explanatory Note GB","index":1,"n_rows":32,"n_cols":6,"rows_kept":32,"cut":false,"hidden":true,"merged":[[14,1,14,10],[18,1,18,10],[34,1,34,10],[6,1,6,10],[8,1,8,10],[10,1,10,10],[12,1,12,10],[24,5,24,10]]}
[null,"REGULATORY SOLVENCY ASSESSMENT - EXPLANATORY NOTE"]
[]
[]
[]
[null,"GENERAL"]
[]
[null,"The Assessment Workbook is intended to be used by every licensed insurer, including each individual cell of Protected Cell Companies, to calculate their Prescribed Capital Requirement (“PCR”) and Minimum Capital Requirement (“MCR”)."]
[]
{"$rows_left_out":25}
{"sheet":"Explanatory Note LTB","index":2,"n_rows":30,"n_cols":6,"rows_kept":30,"cut":false,"hidden":true,"merged":[[24,5,24,10],[33,1,33,10],[6,1,6,10],[8,1,8,10],[10,1,10,10],[12,1,12,10],[14,1,14,10],[18,1,18,10]]}
[null,"REGULATORY SOLVENCY ASSESSMENT - EXPLANATORY NOTE"]
[]
[]
[]
[null,"GENERAL"]
[]
[null,"The Assessment Workbook is intended to be used by every licensed insurer, including each individual cell of Protected Cell Companies, to calculate their Prescribed Capital Requirement (“PCR”) and Minimum Capital Requirement (“MCR”)."]
[]
{"$rows_left_out":23}
{"sheet":"Validation Summary LTB","index":3,"n_rows":42,"n_cols":12,"rows_kept":42,"cut":false,"hidden":false,"merged":[[40,4,40,9],[41,4,41,9],[35,4,35,9],[36,4,36,9],[6,1,6,9],[8,1,8,9],[37,4,37,9],[38,4,38,9],[39,4,39,9]]}
["VALIDATION SUMMARY",null,null,null,null,null,null,null,null,{"$f":"Reporting_Currency","v":"GBP"}]
[{"$f":"Undertaking_Name&\" - \"&Cell_Name","v":" - "},null,null,null,null,null,null,null,null,{"$f":"Assessment_Date","v":"00:00:00"}]
[]
[]
[null,"PURPOSE"]
[]
[null,"The purpose of this sheet is to summarise the validation checks performed throughout the assessment workbook."]
[]
{"$rows_left_out":35}
{"sheet":"Validation Summary GB","index":4,"n_rows":67,"n_cols":12,"rows_kept":67,"cut":false,"hidden":true,"merged":[[53,4,53,9],[8,1,8,9],[6,1,6,9],[35,4,35,9],[36,4,36,9],[38,4,38,9],[52,4,52,9],[50,4,50,9],[51,4,51,9],[37,4,37,9],[40,4,40,9],[42,4,43,9],[47,4,47,9],[48,4,48,9],[49,4,49,9],[39,4,39,9],[41,4,41,9]]}
["VALIDATION SUMMARY",null,null,null,null,null,null,null,null,{"$f":"Reporting_Currency","v":"GBP"}]
[{"$f":"Undertaking_Name&\" - \"&Cell_Name","v":" - "},null,null,null,null,null,null,null,null,{"$f":"Assessment_Date","v":"00:00:00"}]
[]
[]
[null,"PURPOSE"]
[]
[null,"The purpose of this sheet is to summarise the validation checks performed throughout the assessment workbook."]
[]
{"$rows_left_out":60}
{"sheet":"Change Log LTB","index":5,"n_rows":20,"n_cols":11,"rows_kept":20,"cut":false,"hidden":true,"merged":[[10,1,10,10],[11,6,11,8],[14,6,14,8],[19,6,19,8]]}
[null,"REGULATORY SOLVENCY ASSESSMENT "]
[]
[]
[null,"INFORMATION"]
[]
[null,null,null,null,"Current Version:",2]
[]
[]
{"$rows_left_out":13}
{"sheet":"Change Log GB","index":6,"n_rows":23,"n_cols":11,"rows_kept":23,"cut":false,"hidden":true,"merged":[[29,1,29,10],[31,1,31,10],[27,1,27,10],[23,1,23,10],[15,6,15,8],[18,6,18,8],[22,6,22,8],[24,6,24,8]]}
[null,"REGULATORY SOLVENCY ASSESSMENT - CHANGE LOG"]
[]
[]
[null,"INFORMATION"]
[]
[null,null,null,null,"Current Version:",2]
[]
[]
{"$rows_left_out":16}
{"sheet":"Validation Summary Cat6","index":7,"n_rows":32,"n_cols":12,"rows_kept":32,"cut":false,"hidden":true,"merged":[[6,1,6,9],[8,1,8,9]]}
["VALIDATION SUMMARY",null,null,null,null,null,null,null,null,{"$f":"Reporting_Currency","v":"GBP"}]
[{"$f":"Undertaking_Name&\" - \"&Cell_Name","v":" - "},null,null,null,null,null,null,null,null,{"$f":"Assessment_Date","v":"00:00:00"}]
[]
[]
[null,"PURPOSE"]
[]
[null,"The purpose of this sheet is to summarise the validation checks performed throughout the assessment workbook."]
[]
{"$rows_left_out":25}
{"sheet":"Validation Summary Non-Standard","index":8,"n_rows":32,"n_cols":12,"rows_kept":32,"cut":false,"hidden":true,"merged":[[6,1,6,9],[8,1,8,9]]}
["VALIDATION SUMMARY",null,null,null,null,null,null,null,null,{"$f":"Reporting_Currency","v":"GBP"}]
[{"$f":"Undertaking_Name&\" - \"&Cell_Name","v":" - "},null,null,null,null,null,null,null,null,{"$f":"Assessment_Date","v":"00:00:00"}]
[]
[]
[null,"PURPOSE"]
[]
[null,"The purpose of this sheet is to summarise the validation checks performed throughout the assessment workbook."]
[]
{"$rows_left_out":25}
{"sheet":"Undertaking Information","index":9,"n_rows":131,"n_cols":12,"rows_kept":131,"cut":false,"hidden":false,"merged":[[0,7,0,8],[1,7,1,8],[34,3,34,7],[36,3,36,5],[45,1,45,9],[40,3,40,7],[6,3,6,5],[16,3,16,7],[32,3,32,7],[24,3,24,6],[8,3,8,5],[20,3,20,7],[55,1,55,8],[47,1,47,9],[51,1,51,9],[53,1,53,9],[49,1,49,9]]}
["Undertaking Information",null,null,null,null,null,null,{"$f":"Reporting_Currency","v":"GBP"}]
[{"$f":"Undertaking_Name&\" - \"&Cell_Name","v":" - "},null,null,null,null,null,null,{"$f":"Assessment_Date","v":"00:00:00"}]
[null,"v.2.0"]
[]
[null,"ASSESSMENT INFORMATION"]
[]
[null,"Current Financial Year End",null,null,null,null,null,null,null,null,null,{"$f":"IF(D7=\"\",\"ERROR\",\"OK\")","v":"ERROR"}]
[]
{"$rows_left_out":124}
{"sheet":"Summary GB","index":10,"n_rows":106,"n_cols":20,"rows_kept":106,"cut":false,"hidden":true,"merged":[[1,13,1,14]]}
["Guernsey Regulatory Capital Assessment",null,null,null,null,null,null,null,null,null,null,null,null,null,{"$f":"'Undertaking Information'!D11","v":"GBP"}]
[{"$f":"Undertaking_Name&\" - \"&Cell_Name","v":" - "},null,null,null,null,null,null,null,null,null,null,null,null,{"$f":"Assessment_Date","v":"00:00:00"}]
[]
[]
[]
[null,"MINIMUM CAPITAL REQUIREMENT (\"MCR\")",null,{"$f":"Assessment_Date","v":"00:00:00"},null,{"$f":"'Undertaking Information'!D9","v":"00:00:00"}]
[]
[null,"Premium Based Computation"]
{"$rows_left_out":99}
{"sheet":"Balance Sheet Non-standard","index":11,"n_rows":130,"n_cols":4,"rows_kept":130,"cut":false,"hidden":true,"merged":[[131,1,131,2],[4,1,4,2],[51,1,51,2],[95,1,95,2],[129,0,129,6],[130,1,130,2],[143,1,143,2],[132,1,132,2],[133,1,133,2],[134,1,134,2],[135,1,135,2],[136,1,136,2],[137,1,137,2],[138,1,138,2],[139,1,139,2],[140,1,140,2],[141,1,141,2],[142,1,142,2]]}
["REGULATORY BALANCE SHEET",null,null,{"$f":"Reporting_Currency","v":"GBP"}]
[{"$f":"Undertaking_Name&\" - \"&Cell_Name","v":" - "},null,null,{"$f":"Assessment_Date","v":"00:00:00"}]
[]
[null,null,null,"Info"]
[null,"ASSETS",null,"Accounting\nBasis"]
[null,null,null,{"$f":"'Undertaking Information'!$D$11","v":"GBP"}]
[]
[null,"Fixed Assets"]
{"$rows_left_out":123}
{"sheet":"Summary LTB","index":12,"n_rows":90,"n_cols":19,"rows_kept":90,"cut":false,"hidden":false,"merged":[[1,12,1,13]]}
["Guernsey Regulatory Capital Assessment",null,null,null,null,null,null,null,null,null,null,null,null,{"$f":"Reporting_Currency","v":"GBP"}]
[{"$f":"Undertaking_Name","v":"00:00:00"},null,null,null,null,null,null,null,null,null,null,null,{"$f":"Assessment_Date","v":"00:00:00"}]
[]
[]
[]
[null,"MINIMUM CAPITAL REQUIREMENT (\"MCR\")",null,{"$f":"Assessment_Date","v":"00:00:00"},null,{"$f":"'Undertaking Information'!$D$9","v":"00:00:00"}]
[]
[null,"Total Life Business",null,0,null,0]
{"$rows_left_out":83}
{"sheet":"Balance Sheet LTB","index":13,"n_rows":129,"n_cols":26,"rows_kept":129,"cut":false,"hidden":false,"merged":[[142,1,142,2],[131,1,131,2],[132,1,132,2],[133,1,133,2],[134,1,134,2],[135,1,135,2],[136,1,136,2],[137,1,137,2],[138,1,138,2],[139,1,139,2],[140,1,140,2],[141,1,141,2],[130,1,130,2],[0,11,0,19],[0,21,5,21],[0,23,5,23],[2,11,5,11],[2,15,5,15],[2,17,5,17],[2,19,5,19],[2,13,5,13],[4,1,4,2],[58,1,58,2],[95,1,95,2],[128,0,128,8],[129,1,129,2]]}
["REGULATORY BALANCE SHEET",null,null,null,null,null,null,{"$f":"Reporting_Currency","v":"GBP"},null,null,null,"Market Risks",null,null,null,null,null,null,null,null,null,"Default Risk",null,"Underwriting Risk"]
[{"$f":"Undertaking_Name","v":"00:00:00"},null,null,null,null,null,null,{"$f":"Assessment_Date","v":"00:00:00"}]
[null,null,null,null,null,null,null,null,null,null,null,"Interest Rate",null,"Inflation",null,"Spread",null,"Currency",null,"Other"]
[null,null,null,"Info",null,"Info",null,"Info"]
[null,"ASSETS",null,"Accounting\nBasis",null,"Basis\nAdjustments",null,"Regulatory Basis"]
[null,null,null,{"$f":"'Undertaking Information'!$D$11","v":"GBP"},null,{"$f":"'Undertaking Information'!$D$11","v":"GBP"},null,{"$f":"'Undertaking Information'!$D$11","v":"GBP"}]
[]
[null,"Fixed Assets",null,null,null,null,null,null,null,null,null,"Info",null,"Info",null,"Info",null,"Info",null,"Info",null,"Info",null,"Info"]
{"$rows_left_out":122}
{"sheet":"Balance Sheet GB","index":14,"n_rows":114,"n_cols":25,"rows_kept":114,"cut":false,"hidden":true,"merged":[[115,1,115,2],[118,1,118,2],[116,1,116,2],[117,1,117,2],[0,20,5,20],[114,1,114,2],[4,1,4,2],[53,1,53,2],[82,1,82,2],[0,18,5,18],[119,1,119,2],[0,22,5,22],[0,10,0,16],[127,1,127,2],[121,1,121,2],[122,1,122,2],[123,1,123,2],[124,1,124,2],[125,1,125,2],[126,1,126,2],[2,10,5,10],[2,12,5,12],[2,14,5,14],[120,1,120,2],[2,16,5,16],[113,0,113,25]]}
["REGULATORY BALANCE SHEET",null,null,null,null,null,null,{"$f":"Reporting_Currency","v":"GBP"},null,null,"Market Risks",null,null,null,null,null,null,null,"Default Risk",null,"Premium Risk",null,"Reserve Risk"]
[{"$f":"Undertaking_Name&\" - \"&Cell_Name","v":" - "},null,null,null,null,null,null,{"$f":"Assessment_Date","v":"00:00:00"}]
[null,null,null,null,null,null,null,null,null,null,"Interest Rate",null,"Spread",null,"Currency",null,"Other"]
[null,null,null,"Info",null,"Info",null,"Info"]
[null,"ASSETS",null,"Accounting\nBasis",null,"Basis \nAdjustments",null,"Regulatory Basis"]
[null,null,null,{"$f":"'Undertaking Information'!$D$11","v":"GBP"},null,{"$f":"'Undertaking Information'!$D$11","v":"GBP"},null,{"$f":"'Undertaking Information'!$D$11","v":"GBP"}]
[]
[null,"Fixed Assets",null,null,null,null,null,null,null,null,"Info",null,"Info",null,"Info",null,"Info",null,"Info",null,"Info",null,"Info"]
{"$rows_left_out":107}
{"sheet":"Market Risk LTB","index":15,"n_rows":161,"n_cols":53,"rows_kept":161,"cut":false,"hidden":false,"merged":[[115,2,115,14],[2,50,15,50],[2,52,15,52],[4,26,15,26],[4,40,15,40],[0,26,0,46],[24,26,24,52],[4,28,15,28],[4,30,15,30],[4,32,15,32],[4,34,15,34],[4,36,15,36],[4,38,15,38],[0,48,0,52],[2,26,2,40],[2,42,15,42],[2,44,15,44],[2,46,15,46],[2,48,15,48],[21,1,24,2],[21,4,21,6],[55,1,55,14],[21,8,21,12],[22,10,22,12],[120,10,120,11],[121,10,121,11],[122,10,122,11],[121,2,121,3],[122,2,122,3],[123,6,123,7],[121,8,121,9],[122,6,122,7],[160,2,160,14],[156,1,156,2],[156,3,156,6],[156,7,156,10],[156,11,156,14],[154,2,154,15],[144,2,144,14],[152,2,152,15],[153,2,153,15],[158,2,158,15],[151,2,151,15],[146,2,146,15],[150,2,150,15],[148,2,148,15],[149,2,149,15],[120,6,120,7],[121,6,121,7],[120,8,120,9],[123,8,123,9],[122,8,122,9],[123,2,123,3],[122,4,122,5],[123,4,123,5],[120,4,120,5],[121,4,121,5],[120,2,120,3],[142,2,142,14],[135,1,135,2],[132,1,132,14],[133,1,133,14],[127,11,127,14],[124,10,124,11],[127,1,127,2],[127,3,127,6],[125,10,125,11],[135,11,135,14],[127,7,127,10],[124,4,124,5],[125,4,125,5],[125,8,125,9],[129,2,129,15],[137,2,137,15],[131,2,131,14],[124,8,124,9],[125,2,125,3],[124,6,124,7],[125,6,125,7],[135,3,135,6],[124,2,124,3],[135,7,135,10],[110,1,110,2],[110,3,110,6],[110,7,110,10],[110,11,110,14],[49,2,49,14],[59,1,59,2],[90,1,90,14],[91,1,91,14],[92,1,92,14],[53,1,53,14],[61,1,61,14],[62,1,62,15],[88,1,88,14],[86,1,86,2],[89,1,89,14],[106,2,106,15],[93,1,93,14],[94,1,94,14],[95,1,95,14],[112,2,112,15],[123,10,123,11],[117,8,117,9],[117,6,117,7],[118,10,118,11],[105,2,105,15],[101,1,101,2],[97,1,97,14],[98,1,98,14],[99,1,99,14],[117,4,117,5],[107,2,107,15],[117,2,117,3],[118,6,118,7],[119,6,119,7],[119,10,119,11],[118,4,118,5],[119,4,119,5],[118,2,118,3],[119,2,119,3],[118,8,118,9],[119,8,119,9],[117,10,117,11],[103,1,103,14]]}
["MARKET RISK CAPITAL REQUIREMENT",null,null,null,null,null,null,null,null,null,null,null,null,null,null,null,null,null,null,null,null,null,null,null,null,null,"Assets",null,null,null,null,null,null,null,null,null,null,null,null,null,null,null,null,null,null,null,null,null,"Liabilities"]
[{"$f":"Undertaking_Name","v":"00:00:00"}]
[null,null,null,null,null,null,null,null,null,null,null,null,null,null,null,null,null,null,null,null,null,null,null,null,null,null,"Investment Exposures",null,null,null,null,null,null,null,null,null,null,null,null,null,null,null,"Reinsurance Share of Reserves",null,"Off-Balance Sheet Assets",null,"Assets Not Elsewhere Classified",null,"Claim and Premium Reserves",null,"Off-Balance Sheet Liabilities",null,"Liab Not Elsewhere Classified"]
[]
[null,"MARKET RISK",null,null,null,null,null,null,"REQUIRED CAPITAL",null,null,null,null,null,null,null,null,null,null,null,null,null,null,null,null,null,"Government Bonds",null,"Corporate Bonds",null,"Equities",null,"Property",null,"Derivatives",null,"Investment Funds",null,"Deposits",null,"Other Investments"]
[]
[null,"Real Interest Rate Risk",null,null,null,null,null,"Info",{"$f":"O30","v":0},null,null,null,null,null,null,null,null,null,"CorrLob",1,2,3,4,5,6]
[null,"Inflation Rate Risk",null,null,null,null,null,"Info",{"$f":"O34","v":0},null,null,null,null,null,null,null,null,1,"Real Interest Rate Risk",{"$f":"Factors!C85","v":1},{"$f":"Factors!D85","v":0.25},{"$f":"Factors!E85","v":0.25},{"$f":"Factors!F85","v":0.25},{"$f":"Factors!G85","v":0.25},{"$f":"Factors!H85","v":0.25}]
{"$rows_left_out":154}
{"sheet":"Market Risk GB","index":16,"n_rows":108,"n_cols":44,"rows_kept":108,"cut":false,"hidden":true,"merged":[[53,15,53,19],[54,15,54,19],[1,11,1,12],[4,15,15,15],[0,37,0,41],[2,41,15,41],[0,15,0,35],[4,27,15,27],[2,33,15,33],[2,31,15,31],[2,35,15,35],[4,25,15,25],[4,19,15,19],[2,37,15,37],[4,29,15,29],[4,21,15,21],[33,1,34,2],[4,17,15,17],[2,15,2,29],[20,15,20,41],[32,15,32,41],[2,39,15,39],[65,1,66,2],[69,15,69,41],[44,15,44,41],[53,1,53,2],[54,1,54,2],[55,1,55,2],[56,1,56,2],[55,15,55,19],[49,1,49,2],[56,15,56,19],[57,15,57,19],[58,15,58,19],[49,15,49,19],[50,15,50,19],[51,15,51,19],[52,15,52,19],[107,2,108,12],[102,2,102,13],[4,23,15,23],[98,2,98,13],[52,1,52,2],[21,1,22,2],[45,1,46,2],[50,1,50,2],[51,1,51,2],[94,2,94,13],[84,2,84,13],[92,2,92,13],[88,2,88,13],[57,1,57,2],[79,2,79,12],[58,1,58,2]]}
["MARKET RISK CAPITAL REQUIREMENT",null,null,null,null,null,null,null,null,null,null,null,{"$f":"Reporting_Currency","v":"GBP"},null,null,"Assets",null,null,null,null,null,null,null,null,null,null,null,null,null,null,null,null,null,null,null,null,null,"Liabilities"]
[{"$f":"Undertaking_Name&\" - \"&Cell_Name","v":" - "},null,null,null,null,null,null,null,null,null,null,{"$f":"Assessment_Date","v":"00:00:00"}]
[null,null,null,null,null,null,null,null,null,null,null,null,null,null,null,"Investment Exposures",null,null,null,null,null,null,null,null,null,null,null,null,null,null,null,"Reinsurance Share of Reserves",null,"Off-Balance Sheet Assets",null,"Assets Not Elsewhere Classified",null,"Claim and Premium Reserves",null,"Off-Balance Sheet Liabilities",null,"Liab Not Elsewhere Classified"]
[]
[null,"MARKET RISK",null,null,null,null,null,null,"REQUIRED CAPITAL",null,null,null,null,null,null,"Government Bonds",null,"Corporate Bonds",null,"Equities",null,"Property",null,"Derivatives",null,"Investment Funds",null,"Deposits",null,"Other Investments"]
[]
[null,"Interest Rate Risk",null,null,null,null,null,"Info",{"$f":"M29","v":0}]
[null,"Spread Risk",null,null,null,null,null,"Info",{"$f":"M41","v":0}]
{"$rows_left_out":101}
{"sheet":"Default Risk LTB","index":17,"n_rows":117,"n_cols":16,"rows_kept":117,"cut":false,"hidden":false,"merged":[[1,14,1,15],[109,3,111,3],[116,3,116,11],[118,3,118,11],[120,3,120,11],[122,3,122,11],[83,5,83,11],[97,9,97,11],[100,11,102,11],[100,3,102,3],[14,1,15,1],[13,5,13,7],[14,5,14,7],[106,3,108,3],[68,2,68,13],[71,2,71,13],[103,3,105,3]]}
["COUNTERPARTY DEFAULT RISK CAPITAL REQUIREMENT",null,null,null,null,null,null,null,null,null,null,null,null,null,null,{"$f":"Reporting_Currency","v":"GBP"}]
[{"$f":"Undertaking_Name","v":"00:00:00"},null,null,null,null,null,null,null,null,null,null,null,null,null,{"$f":"Assessment_Date","v":"00:00:00"}]
[]
[]
[null,"COUNTERPARTY DEFAULT RISK",null,null,null,"REQUIRED CAPITAL"]
[null,null,null,null,null,null,null,null,null,null,null,"Reinsurance share of reserves",null,{"$f":"SUMIF($D$33:$D$63,L6,$H$33:$H$63)","v":0},null,{"$f":"IF(N6='Balance Sheet LTB'!H36+'Balance Sheet LTB'!H35,\"OK\",\"ERROR\")","v":"OK"}]
[null,"Receivables",null,null,null,{"$f":"J26","v":0},null,null,null,null,null,"Loans",null,{"$f":"SUMIF($D$33:$D$63,L7,$H$33:$H$63)","v":0},null,{"$f":"IF(N7='Balance Sheet LTB'!H30,\"OK\",\"ERROR\")","v":"OK"}]
[null,"Other Exposures",null,null,null,{"$f":"P65","v":0},null,null,null,null,null,"Cash and cash equivalents",null,{"$f":"SUMIF($D$33:$D$63,L8,$H$33:$H$63)","v":0},null,{"$f":"IF(N8='Balance Sheet LTB'!H43+'Balance Sheet LTB'!H44,\"OK\",\"ERROR\")","v":"OK"}]
{"$rows_left_out":110}
{"sheet":"Default Risk GB","index":18,"n_rows":115,"n_cols":16,"rows_kept":115,"cut":false,"hidden":true,"merged":[[14,1,15,1],[14,5,14,7],[68,2,68,13],[71,2,71,13],[83,5,83,11],[100,3,102,3],[100,11,102,11],[1,14,1,15],[13,5,13,7],[118,3,118,11],[97,9,97,11],[122,3,122,11],[103,3,105,3],[106,3,108,3],[109,3,111,3],[116,3,116,11],[120,3,120,11]]}
["COUNTERPARTY DEFAULT RISK CAPITAL REQUIREMENT",null,null,null,null,null,null,null,null,null,null,null,null,null,null,{"$f":"Reporting_Currency","v":"GBP"}]
[{"$f":"Undertaking_Name","v":"00:00:00"},null,null,null,null,null,null,null,null,null,null,null,null,null,{"$f":"Assessment_Date","v":"00:00:00"}]
[]
[]
[null,"COUNTERPARTY DEFAULT RISK",null,null,null,"REQUIRED CAPITAL"]
[null,null,null,null,null,null,null,null,null,null,null,"Reinsurance share of reserves",null,{"$f":"SUMIF($D$33:$D$63,L6,$H$33:$H$63)","v":0},null,{"$f":"IF(N6='Balance Sheet GB'!H32+'Balance Sheet GB'!H33,\"OK\",\"ERROR\")","v":"OK"}]
[null,"Receivables",null,null,null,{"$f":"J26","v":0},null,null,null,null,null,"Loans",null,{"$f":"SUMIF($D$33:$D$63,L7,$H$33:$H$63)","v":0},null,{"$f":"IF(N7='Balance Sheet GB'!H27,\"OK\",\"ERROR\")","v":"OK"}]
[null,"Other Exposures",null,null,null,{"$f":"P65","v":0},null,null,null,null,null,"Cash and cash equivalents",null,{"$f":"SUMIF($D$33:$D$63,L8,$H$33:$H$63)","v":0},null,{"$f":"IF(N8='Balance Sheet GB'!H39,\"OK\",\"ERROR\")","v":"OK"}]
{"$rows_left_out":108}
{"sheet":"Premium Risk","index":19,"n_rows":71,"n_cols":56,"rows_kept":71,"cut":false,"hidden":true,"merged":[[65,1,65,17],[27,17,27,19],[56,1,56,24],[1,25,1,27],[61,1,61,17],[27,21,27,23],[26,4,26,12]]}
["PREMIUM RISK CAPITAL REQUIREMENT",null,null,null,null,null,null,null,null,null,null,null,null,null,null,null,null,null,null,null,null,null,null,null,null,null,null,{"$f":"Reporting_Currency","v":"GBP"}]
[{"$f":"Undertaking_Name&\" - \"&Cell_Name","v":" - "},null,null,null,null,null,null,null,null,null,null,null,null,null,null,null,null,null,null,null,null,null,null,null,null,{"$f":"Assessment_Date","v":"00:00:00"}]
[]
[null,null,null,null,null,null,null,null,null,null,null,null,null,null,null,null,null,null,null,null,null,null,null,null,null,null,null,null,null,null,null,null,null,null,null,null,null,null,null,null,null,null,null,"Motor","Gen Liab","Casulty (NP)","MAT","MAT (NP)","Property","Prop (NP)","Legal Exp","Misc","Health","Health (NP)","Div. Effects","Capital Req't"]
[null,"PREMIUM RISK",null,null,null,"REQUIRED CAPITAL",null,null,null,null,null,null,null,null,null,null,null,null,null,null,null,null,null,null,null,null,null,null,null,null,null,null,null,null,null,null,null,null,null,null,null,"Invisible",null,"Motor","Gen\nLiab","Casulty\n(NP)","MAT","MAT\n(NP)","Property","Prop\n(NP)","Legal\nExp","Misc","Health","Health \n(NP)","Div.\nEffects","Capital\nReq'd"]
[]
[null,{"$f":"Factors!B44","v":"Motor"},null,null,null,{"$f":"SUMIF($D$32:$D$52,B7,$AB$32:$AB$52)","v":0},null,null,null,null,null,null,null,null,null,null,null,null,null,null,null,null,null,null,null,null,null,null,null,null,null,null,null,null,null,null,null,null,null,null,1,0,null,{"$f":"$F7/$F$23","v":{"$error":"#DIV/0!"}}]
[null,{"$f":"Factors!B45","v":"General Liability"},null,null,null,0,null,null,null,null,null,null,null,null,null,null,null,null,null,null,null,null,null,null,null,null,null,null,null,null,null,null,null,null,null,null,null,null,null,null,2,{"$f":"SUM(AP7,AR7:BB7)-BC8","v":{"$error":"#DIV/0!"}},null,null,{"$f":"$F8/$F$23","v":{"$error":"#DIV/0!"}}]
{"$rows_left_out":64}
{"sheet":"Reserve Risk","index":20,"n_rows":113,"n_cols":40,"rows_kept":113,"cut":false,"hidden":true,"merged":[[1,17,1,19],[112,1,112,17],[76,1,76,17],[84,1,84,17],[65,1,65,19],[88,1,88,17],[104,1,104,17],[70,1,70,17],[70,19,70,25],[80,1,80,17]]}
["RESERVE RISK CAPITAL REQUIREMENT",null,null,null,null,null,null,null,null,null,null,null,null,null,null,null,null,null,null,{"$f":"Reporting_Currency","v":"GBP"}]
[{"$f":"Undertaking_Name&\" - \"&Cell_Name","v":" - "},null,null,null,null,null,null,null,null,null,null,null,null,null,null,null,null,{"$f":"Assessment_Date","v":"00:00:00"}]
[]
[null,null,null,null,null,null,null,null,null,null,null,null,null,null,null,null,null,null,null,null,null,null,null,null,null,null,null,"Motor","Gen Liab","Casulty (NP)","MAT","MAT (NP)","Property","Prop (NP)","Legal Exp","Misc","Health","Health (NP)","Div. Effects","Capital Req't"]
[null,"RESERVE RISK",null,null,null,"REQUIRED CAPITAL",null,null,null,null,null,null,null,null,null,null,null,null,null,null,null,null,null,null,null,"Invisible",null,"Motor","Gen\nLiab","Casulty\n(NP)","MAT","MAT\n(NP)","Property","Prop\n(NP)","Legal\nExp","Misc","Health","Health \n(NP)","Div.\nEffects","Capital\nReq'd"]
[]
[null,{"$f":"Factors!B44","v":"Motor"},null,null,null,{"$f":"SUMIF($D$31:$D$61,B7,$T$31:$T$61)","v":0},null,null,null,null,null,null,null,null,null,null,null,null,null,null,null,null,null,null,1,0,null,{"$f":"$F7/$F$23","v":{"$error":"#DIV/0!"}}]
[null,{"$f":"Factors!B45","v":"General Liability"},null,null,null,{"$f":"SUMIF($D$31:$D$61,B8,$T$31:$T$61)","v":0},null,null,null,null,null,null,null,null,null,null,null,null,null,null,null,null,null,null,2,{"$f":"SUM(Z7,AB7:AL7)-AM8","v":{"$error":"#DIV/0!"}},null,null,{"$f":"$F8/$F$23","v":{"$error":"#DIV/0!"}}]
{"$rows_left_out":106}
{"sheet":"Under'g Risk LTB","index":21,"n_rows":90,"n_cols":33,"rows_kept":90,"cut":false,"hidden":false,"merged":[[84,1,84,13],[83,1,83,13],[20,1,23,1],[61,1,61,13],[60,1,60,13],[20,7,20,11],[73,1,73,13],[69,1,69,14],[59,1,59,14],[63,1,63,14],[21,9,21,11],[55,1,55,14],[1,12,1,13],[56,1,56,13],[76,1,76,14],[80,1,80,14],[44,1,44,11],[48,1,48,14],[50,1,50,14]]}
["LONG TERM BUSINESS - UNDERWRITING RISK CAPITAL REQUIREMENT",null,null,null,null,null,null,null,null,null,null,null,null,{"$f":"Reporting_Currency","v":"GBP"}]
[{"$f":"'Undertaking Information'!D17","v":"00:00:00"},null,null,null,null,null,null,null,null,null,null,null,{"$f":"'Undertaking Information'!D7","v":"00:00:00"}]
[]
[]
[null,"LTB UNDERWRITING RISK",null,null,null,"REQUIRED CAPITAL"]
[]
[null,"Mortality Risk",null,null,null,{"$f":"N26","v":0},null,null,null,null,null,null,null,null,null,null,null,"Corr/Risks",1,2,3,4,5,6]
[null,"Longevity Risk",null,null,null,{"$f":"N28","v":0},null,null,null,null,null,null,null,null,null,null,1,"Mortality",{"$f":"Factors!C99","v":1},{"$f":"Factors!D99","v":-0.25},{"$f":"Factors!E99","v":0.25},{"$f":"Factors!F99","v":0},{"$f":"Factors!G99","v":0.25},{"$f":"Factors!H99","v":0.25}]
{"$rows_left_out":83}
{"sheet":"Factors","index":22,"n_rows":357,"n_cols":33,"rows_kept":357,"cut":false,"hidden":false,"merged":[[219,20,219,23],[250,7,250,8],[250,4,250,6],[219,8,219,11],[219,2,219,5],[219,14,219,17],[272,4,272,8],[232,2,232,4],[241,2,241,4],[263,4,263,5],[263,7,263,9],[187,8,187,9],[187,2,187,3],[187,6,187,7],[187,4,187,5],[86,9,86,10],[87,9,87,10],[88,9,88,10],[83,9,83,10],[89,9,89,10],[19,2,19,3],[161,2,161,3],[41,2,41,3],[41,4,41,5],[41,8,41,9],[41,6,41,7],[84,9,84,10]]}
["REGULATORY SOLVENCY ASSESSMENT"]
["Capital Factors"]
[]
[null,"Business Type:",{"$f":"VLOOKUP('Undertaking Information'!D25,'For GFSC Portal Use Only'!H20:J27,3,FALSE)","v":"Commercial Life Insurer"}]
[null,"Reporting Currency:",{"$f":"'Undertaking Information'!D11","v":"GBP"}]
[null,"Rate of Exchange:",{"$f":"'Undertaking Information'!D13","v":1}]
[null,"Protected Cell Company:",{"$f":"'Undertaking Information'!D19","v":0}]
[]
{"$rows_left_out":350}
{"sheet":"Balance Sheet Cat6","index":23,"n_rows":100,"n_cols":4,"rows_kept":100,"cut":false,"hidden":true,"merged":[[113,1,113,2],[102,1,102,2],[103,1,103,2],[104,1,104,2],[105,1,105,2],[106,1,106,2],[107,1,107,2],[108,1,108,2],[109,1,109,2],[110,1,110,2],[111,1,111,2],[112,1,112,2],[101,1,101,2],[4,1,4,2],[47,1,47,2],[75,1,75,2],[99,0,99,6],[100,1,100,2]]}
["REGULATORY BALANCE SHEET",null,null,{"$f":"Reporting_Currency","v":"GBP"}]
[{"$f":"Undertaking_Name&\" - \"&Cell_Name","v":" - "},null,null,{"$f":"Assessment_Date","v":"00:00:00"}]
[]
[null,null,null,"Info"]
[null,"ASSETS",null,"Accounting\nBasis"]
[null,null,null,{"$f":"'Undertaking Information'!$D$11","v":"GBP"}]
[]
[null,"Fixed Assets"]
{"$rows_left_out":92}