{"text_format":"1","workbook":"xlsx","n_sheets":6,"sheets":["For GFSC Portal Use Only","Validation","Summary","MCR","PCR","Factors"],"not_rendered":{"charts":0,"images":0,"macros":1,"external_links":2,"defined_names":8,"comments":0,"pivot_tables":0},"unopened":[],"bounds":{"document_bytes":16777216,"sheet_cells":100000,"rows_first":2000,"rows_last":500,"rows_between":2000,"halvings":0,"cell_chars":16384,"cell_head_chars":4096},"cells_cut":0,"cells_raw":0,"read":"whole","date_system":"1900"}

{"sheet":"For GFSC Portal Use Only","index":0,"n_rows":13,"n_cols":4,"rows_kept":13,"cut":false,"hidden":true,"merged":[]}
[null,"Form Name","PCC","Name"]
[null,"Form Version","v2.0","Vn.n"]
[]
[null,"Licensee Name",{"$f":"Summary!D7","v":"00:00:00"}]
[null,"Name Reference",{"$f":"Summary!D17","v":0}]
[null,"Frequency","A","M,Q,A"]
[]
[null,"Reporting Date",{"$f":"Summary!D9","v":"00:00:00"},"MONTH YYYY"]
[]
[null,"Mandatory Validation",{"$f":"IF(Validation!C11=\"OK\",\"T\",\"F\")","v":"F"},"T or F"]
[]
[]
[null,"Optional Validation","T","T or F"]

{"sheet":"Validation","index":1,"n_rows":26,"n_cols":12,"rows_kept":26,"cut":false,"hidden":false,"merged":[[6,1,6,9],[8,1,8,9],[22,4,22,9]]}
["VALIDATION SUMMMARY",null,null,null,null,null,null,null,null,{"$f":"Summary!D11","v":0}]
[{"$f":"Summary!D7","v":"00:00:00"},null,null,null,null,null,null,null,null,{"$f":"Summary!D9","v":"00:00:00"}]
[]
[]
[null,"PURPOSE"]
[]
[null,"The purpose of this sheet is to summarise the validation checks performed throughout the PCC Solvency Summary Workbook."]
[]
[null,"PCCs should check that all validation checks read 'OK' before submitting the summary workbook."]
[]
[null,null,{"$f":"IF(L11>0,\"ERROR\",\"OK\")","v":"ERROR"},null,{"$f":"IF(C11=\"ERROR\",L11&\" VALIDATION CHECKS TO REVIEW\",\"ALL VALIDATION CHECKS READ OK\")","v":"6 VALIDATION CHECKS TO REVIEW"},null,null,null,null,null,null,{"$f":"SUM(L15:L27)","v":6}]
[]
[null,"Summary"]
[]
[null,null,{"$f":"Summary!G7","v":"ERROR"},null,"The PCC's name has been entered",null,null,null,null,null,null,{"$f":"IF(C15=\"ERROR\",1,0)","v":1}]
[null,null,{"$f":"Summary!G9","v":"ERROR"},null,"The date of the current financial year end has been entered",null,null,null,null,null,null,1]
[null,null,{"$f":"Summary!G11","v":"ERROR"},null,"The consolidated reporting currency has been selected",null,null,null,null,null,null,1]
[null,null,{"$f":"Summary!G13","v":"ERROR"},null,"The rate of exchange has been entered",null,null,null,null,null,null,1]
[null,null,{"$f":"Summary!G15","v":"ERROR"},null,"The risk type has been selected",null,null,null,null,null,null,1]
[null,null,{"$f":"Summary!G17","v":"ERROR"},null,"The GFSC Reference Number has been added",null,null,null,null,null,null,1]
[null,"MCR"]
[]
[null,null,{"$f":"IF(MCR!Z9=\"ERROR\",\"ERROR\",\"OK\")","v":"OK"},null,"A mixture of general and long term business cells are stated as having recourse to the core.",null,null,null,null,null,null,{"$f":"IF(C23=\"ERROR\",1,0)","v":0}]
[null,null,{"$f":"IF(MCR!AD9=\"ERROR\",\"ERROR\",\"OK\")","v":"OK"},null,"The mix of business written in the PCC does not match the risk type selected on the Summary sheet.",null,null,null,null,null,null,{"$f":"IF(C24=\"ERROR\",1,0)","v":0}]
[null,null,{"$f":"IF(COUNTIF(MCR!AG21:AG234,\"ERROR\")>0,\"ERROR\",\"OK\")","v":"OK"},null,"The risk type for one or more cells is inconsistent with the risk type of the PCC entity.",null,null,null,null,null,null,{"$f":"IF(C25=\"ERROR\",1,0)","v":0}]
[null,null,{"$f":"IF(COUNTIF(MCR!AI21:AI234,\"ERROR\")>0,\"ERROR\",\"OK\")","v":"OK"},null,"The rate of exchange is inconsistent with the reporting currency of one or more Cells.",null,null,null,null,null,null,{"$f":"IF(C26=\"ERROR\",1,0)","v":0}]

{"sheet":"Summary","index":2,"n_rows":94,"n_cols":9,"rows_kept":94,"cut":false,"hidden":false,"merged":[[54,1,55,1],[18,1,19,1]]}
["Guernsey Regulatory Capital Assessment"]
[{"$f":"D7","v":"00:00:00"}]
[]
[null,"v.2.0"]
[null,"UNDERTAKING INFORMATION"]
[]
[null,"PCC Name",null,null,null,null,{"$f":"IF(D7=\"\",\"ERROR\",\"OK\")","v":"ERROR"}]
[]
[null,"Current Financial Year End",null,null,null,null,{"$f":"IF(D9=\"\",\"ERROR\",\"OK\")","v":"ERROR"}]
[]
[null,"Consolidated Reporting Currency",null,null,null,null,{"$f":"IF(D11=\"\",\"ERROR\",\"OK\")","v":"ERROR"}]
[]
[null,"Consolidated Rate of Exchange, £1GBP =",null,1,null,null,{"$f":"IF(OR(D13=\"\",AND(D11=\"GBP\",D13<>1), AND(D11<>\"GBP\",D13=1)),\"ERROR\",\"OK\")","v":"ERROR"}]
[]
[null,"Risk Type",null,null,null,null,{"$f":"IF(OR(D15=\"\",AND(D13=\"GBP\",D15<>1), AND(D13<>\"GBP\",D15=1)),\"ERROR\",\"OK\")","v":"ERROR"}]
[]
[null,"GFSC Reference Number",null,null,null,null,{"$f":"IF(D17=\"\",\"ERROR\",\"OK\")","v":"ERROR"}]
[]
[null,"MINIMUM CAPITAL REQUIREMENT (\"MCR\")",null,"PCC Entity"]
[null,null,null,{"$f":"$D$11","v":"00:00:00"}]
[]
[null,"Capital Resources Available to Meet Unadjusted MCR (i.e. Before Capital Floor and Regulatory Adjustment)"]
[]
[null,"Unadjusted MCR",null,{"$f":"SUM(MCR!$L$17:$L$238)","v":0}]
[]
[null,"Capital Resources to Cover Unadjusted MCR",null,{"$f":"SUM(MCR!$AB$17:$AB$238)","v":0}]
[]
[null,"Solvency Deficit",null,{"$f":"MAX(D24-D26,0)","v":0}]
[]
[null,"Excess Capital Resources in Cells (only available if MCR = Capital Floor)",null,{"$f":"SUM(MCR!$X$17:$X$238)","v":0}]
{"$rows_left_out":65}
{"sheet":"MCR","index":3,"n_rows":235,"n_cols":35,"rows_kept":235,"cut":false,"hidden":false,"merged":[[11,12,12,12],[11,3,12,3],[3,25,3,26],[3,27,3,28],[4,25,4,26],[5,25,5,26],[6,25,6,26],[4,27,4,28],[0,27,0,29],[6,27,6,28],[11,5,12,5],[11,7,12,7],[5,27,5,28],[11,16,12,16],[11,17,12,17],[11,18,12,18],[4,23,4,24],[5,23,5,24],[6,23,6,24],[0,13,0,14],[1,13,1,14],[11,19,12,19],[11,9,11,11],[11,13,11,15]]}
["Guernsey Regulatory Capital Assessment",null,null,null,null,null,null,null,null,null,null,null,null,null,null,null,null,null,null,null,null,null,null,null,null,null,null,{"$f":"Summary!D9","v":"00:00:00"}]
[{"$f":"Summary!D7","v":"00:00:00"}]
[]
[null,null,null,null,null,null,null,null,null,null,null,null,null,null,null,null,null,null,null,null,null,null,null,null,null,"With Recourse",null,"Without Recourse",null,"Total"]
[null,null,null,null,null,null,null,null,null,null,null,null,null,null,null,null,null,null,null,null,null,null,null,"General Business",null,{"$f":"COUNTIFS($D$21:$D$65536,\"GB\",$T$21:$T$65536,\"Yes\")","v":0},null,{"$f":"COUNTIFS($D$21:$D$65536,\"GB\",$T$21:$T$65536,\"No\")","v":0},null,{"$f":"Z5+AB5","v":0}]
[null,null,null,null,null,null,null,null,null,null,null,null,null,null,null,null,null,null,null,null,null,null,null,"Long Term Business",null,{"$f":"COUNTIFS($D$21:$D$65536,\"LB\",$T$21:$T$65536,\"Yes\")","v":0},null,{"$f":"COUNTIFS($D$21:$D$65536,\"LB\",$T$21:$T$65536,\"No\")","v":0},null,{"$f":"Z6+AB6","v":0}]
[null,"MINIMUM CAPITAL REQUIREMENT (\"MCR\")",null,null,null,null,null,null,null,null,null,null,null,null,null,null,null,null,null,null,null,null,null,"Total Business",null,{"$f":"Z5+Z6","v":0},null,{"$f":"AB5+AB6","v":0},null,{"$f":"AD5+AD6","v":0}]
[]
[null,null,null,null,null,null,null,null,null,null,null,null,null,null,null,null,null,null,null,null,null,null,null,null,null,{"$f":"IF(AND(Z5>0,Z6>0),\"ERROR\",\"\")","v":""},null,null,null,{"$f":"IF(OR(AND(Summary!D15=\"Composite\",OR(AD5=0,AD6=0)),AND(AD5>0,AD6>0,Summary!D15<>\"Composite\"),AND(Summary!D15=\"General Business\",AD6>0),AND(Summary!D15=\"Long Term Business\",AD5>0)),\"ERROR\",\"\")","v":""}]
[]
[null,"Info",null,"Info",null,"Info",null,"Info",null,"Info",null,null,null,"Info",null,null,null,null,null,"Info",null,null,null,null,null,"Info"]
[null,"Name",null,"Risk \nType",null,"Reporting Currency\n\nRep CCY",null,"Rate of Exchange",null,"Notional MCR",null,null,null,"Regulatory Capital Resources to Meet Notional MCR",null,null,null,"Cell Notional \nMCR\nRatio",null,"Recourse Agreement with Core?",null,"Cell Regulatory Capital Resources to Meet PCC MCR",null,"Excess Cell Regulatory Capital Resources",null,"Core Regulatory Capital Resources to Meet PCC MCR",null,"Total Regulatory Capital Resources to Meet PCC MCR",null,"Notional \nMCR\nRatio"]
[null,null,null,null,null,null,null,null,null,"Rep CCY",null,{"$f":"$F$17","v":0},null,"Rep CCY",null,{"$f":"$F$17","v":0},null,null,null,null,null,{"$f":"$F$17","v":0},null,{"$f":"$F$17","v":0},null,{"$f":"$F$17","v":0},null,{"$f":"$F$17","v":0}]
[]
[null,"CORE"]
[]
[null,"Core",null,null,null,{"$f":"Summary!D11","v":0},null,{"$f":"Summary!D13","v":1},null,0,null,{"$f":"IFERROR(J17*$H$17/$H17,0)","v":0},null,0,null,{"$f":"IFERROR(N17*$H$17/$H17,0)","v":0},null,null,null,"n/a",null,null,null,null,null,{"$f":"P17-SUM(Z21:Z234)","v":0},null,{"$f":"MIN(Z17,L17)","v":0},null,{"$f":"IF(AND($B17<>\"\",$L17=0),\"Infinite\",IF($B17=\"\",\"  -  \",$AB17/$L17))","v":"Infinite"}]
[]
[null,"CELLS",null,null,null,null,null,null,null,null,null,null,null,null,null,null,null,null,null,null,null,null,null,null,null,{"$f":"IF(AND(Z17<L17, Z17<P17),\"THE CORE CAPITAL CANNOT BE LESS THAN THE CORE'S NOTIONAL MCR, REDUCE CAPITAL ALLOCATED TO CELLS\",\"\")","v":""},null,null,null,null,null,null,"Risk Type",null,"Exch Rate"]
[]
[null,null,null,null,null,null,null,null,null,0,null,{"$f":"IFERROR(J21*$H$17/$H21,0)","v":0},null,0,null,{"$f":"IFERROR(N21*$H$17/$H21,0)","v":0},null,{"$f":"IF(AND($B21<>\"\",$L21=0),\"Infinite\",IF($B21=\"\",\"  -  \",$P21/$L21))","v":"  -  "},null,null,null,{"$f":"MIN(L21,P21)","v":0},null,{"$f":"P21-V21","v":0},null,0,null,{"$f":"V21+Z21","v":0},null,{"$f":"IF(AND($B21<>\"\",$L21=0),\"Infinite\",IF($B21=\"\",\"  -  \",$AB21/$L21))","v":"  -  "},null,null,{"$f":"IF(OR(AND(Summary!$D$15=\"General Business\",MCR!D21=\"LB\"),AND(Summary!$D$15=\"Long Term Business\",MCR!D21=\"GB\")),\"ERROR\",\"\")","v":""},null,{"$f":"IF(OR(AND(F21<>\"\",H21=\"\"),AND(F21=\"GBP\",H21<>1), AND(F21<>\"GBP\",H21=1)),\"ERROR\",\"\")","v":""}]
[null,null,null,null,null,null,null,null,null,0,null,0,null,0,null,{"$f":"IFERROR(N22*$H$17/$H22,0)","v":0},null,{"$f":"IF(AND($B22<>\"\",$L22=0),\"Infinite\",IF($B22=\"\",\"  -  \",$P22/$L22))","v":"  -  "},null,null,null,{"$f":"MIN(L22,P22)","v":0},null,{"$f":"P22-V22","v":0},null,0,null,0,null,"  -  ",null,null,{"$f":"IF(OR(AND(Summary!$D$15=\"General Business\",MCR!D22=\"LB\"),AND(Summary!$D$15=\"Long Term Business\",MCR!D22=\"GB\")),\"ERROR\",\"\")","v":""},null,""]
[null,null,null,null,null,null,null,null,null,0,null,0,null,0,null,0,null,"  -  ",null,null,null,0,null,0,null,0,null,0,null,"  -  ",null,null,{"$f":"IF(OR(AND(Summary!$D$15=\"General Business\",MCR!D23=\"LB\"),AND(Summary!$D$15=\"Long Term Business\",MCR!D23=\"GB\")),\"ERROR\",\"\")","v":""},null,""]
[null,null,null,null,null,null,null,null,null,0,null,0,null,0,null,0,null,"  -  ",null,null,null,0,null,0,null,0,null,0,null,"  -  ",null,null,{"$f":"IF(OR(AND(Summary!$D$15=\"General Business\",MCR!D24=\"LB\"),AND(Summary!$D$15=\"Long Term Business\",MCR!D24=\"GB\")),\"ERROR\",\"\")","v":""},null,""]
[null,null,null,null,null,null,null,null,null,0,null,0,null,0,null,0,null,"  -  ",null,null,null,0,null,0,null,0,null,0,null,"  -  ",null,null,{"$f":"IF(OR(AND(Summary!$D$15=\"General Business\",MCR!D25=\"LB\"),AND(Summary!$D$15=\"Long Term Business\",MCR!D25=\"GB\")),\"ERROR\",\"\")","v":""},null,""]
[null,null,null,null,null,null,null,null,null,0,null,0,null,0,null,0,null,"  -  ",null,null,null,0,null,0,null,0,null,0,null,"  -  ",null,null,{"$f":"IF(OR(AND(Summary!$D$15=\"General Business\",MCR!D26=\"LB\"),AND(Summary!$D$15=\"Long Term Business\",MCR!D26=\"GB\")),\"ERROR\",\"\")","v":""},null,""]
[null,null,null,null,null,null,null,null,null,0,null,0,null,0,null,0,null,"  -  ",null,null,null,0,null,0,null,0,null,0,null,"  -  ",null,null,{"$f":"IF(OR(AND(Summary!$D$15=\"General Business\",MCR!D27=\"LB\"),AND(Summary!$D$15=\"Long Term Business\",MCR!D27=\"GB\")),\"ERROR\",\"\")","v":""},null,""]
[null,null,null,null,null,null,null,null,null,0,null,0,null,0,null,0,null,"  -  ",null,null,null,0,null,0,null,0,null,0,null,"  -  ",null,null,{"$f":"IF(OR(AND(Summary!$D$15=\"General Business\",MCR!D28=\"LB\"),AND(Summary!$D$15=\"Long Term Business\",MCR!D28=\"GB\")),\"ERROR\",\"\")","v":""},null,""]
[null,null,null,null,null,null,null,null,null,0,null,0,null,0,null,0,null,"  -  ",null,null,null,0,null,0,null,0,null,0,null,"  -  ",null,null,{"$f":"IF(OR(AND(Summary!$D$15=\"General Business\",MCR!D29=\"LB\"),AND(Summary!$D$15=\"Long Term Business\",MCR!D29=\"GB\")),\"ERROR\",\"\")","v":""},null,""]
[null,null,null,null,null,null,null,null,null,0,null,0,null,0,null,0,null,"  -  ",null,null,null,0,null,0,null,0,null,0,null,"  -  ",null,null,{"$f":"IF(OR(AND(Summary!$D$15=\"General Business\",MCR!D30=\"LB\"),AND(Summary!$D$15=\"Long Term Business\",MCR!D30=\"GB\")),\"ERROR\",\"\")","v":""},null,""]
{"$rows_left_out":206}
{"sheet":"PCR","index":4,"n_rows":235,"n_cols":35,"rows_kept":235,"cut":false,"hidden":false,"merged":[[4,23,4,24],[4,25,4,26],[4,27,4,28],[5,27,5,28],[6,27,6,28],[0,13,0,14],[0,27,0,29],[1,13,1,14],[3,25,3,26],[3,27,3,28],[11,3,12,3],[11,5,12,5],[11,7,12,7],[5,23,5,24],[5,25,5,26],[6,23,6,24],[6,25,6,26],[11,18,12,18],[11,19,12,19],[11,9,11,11],[11,13,11,15],[11,12,12,12],[11,16,12,16],[11,17,12,17]]}
["Guernsey Regulatory Capital Assessment",null,null,null,null,null,null,null,null,null,null,null,null,null,null,null,null,null,null,null,null,null,null,null,null,null,null,{"$f":"Summary!D9","v":"00:00:00"}]
[{"$f":"Summary!D7","v":"00:00:00"}]
[]
[null,null,null,null,null,null,null,null,null,null,null,null,null,null,null,null,null,null,null,null,null,null,null,null,null,"With Recourse",null,"Without Recourse",null,"Total"]
[null,null,null,null,null,null,null,null,null,null,null,null,null,null,null,null,null,null,null,null,null,null,null,"General Business",null,{"$f":"COUNTIFS($D$21:$D$65536,\"GB\",$T$21:$T$65536,\"Yes\")","v":0},null,{"$f":"COUNTIFS($D$21:$D$65536,\"GB\",$T$21:$T$65536,\"No\")","v":0},null,{"$f":"Z5+AB5","v":0}]
[null,null,null,null,null,null,null,null,null,null,null,null,null,null,null,null,null,null,null,null,null,null,null,"Long Term Business",null,{"$f":"COUNTIFS($D$21:$D$65536,\"LB\",$T$21:$T$65536,\"Yes\")","v":0},null,{"$f":"COUNTIFS($D$21:$D$65536,\"LB\",$T$21:$T$65536,\"No\")","v":0},null,{"$f":"Z6+AB6","v":0}]
[null,"PRESCRIBED CAPITAL REQUIREMENT (\"PCR\")",null,null,null,null,null,null,null,null,null,null,null,null,null,null,null,null,null,null,null,null,null,"Total Business",null,{"$f":"Z5+Z6","v":0},null,{"$f":"AB5+AB6","v":0},null,{"$f":"AD5+AD6","v":0}]
[]
[]
[]
[null,{"$f":"MCR!B11","v":"Info"},null,"Info",null,"Info",null,"Info",null,"Info",null,null,null,"Info",null,null,null,null,null,"Info",null,null,null,null,null,"Info"]
[null,"Name",null,"Risk \nType",null,"Reporting Currency\n\nRep CCY",null,"Rate of Exchange",null,"Notional PCR",null,null,null,"Regulatory Capital Resources to Meet Notional PCR",null,null,null,"Cell Notional \nPCR\nRatio",null,"Recourse Agreement with Core?",null,"Cell Regulatory Capital Resources to Meet PCC PCR",null,"Excess Cell Regulatory Capital Resources ",null,"Core Regulatory Capital Resources to Meet PCC PCR",null,"Total Regulatory Capital Resources to Meet PCC PCR",null,"Notional \nPCR\nRatio"]
[null,null,null,null,null,null,null,null,null,"Rep CCY",null,{"$f":"$F$17","v":0},null,"Rep CCY",null,{"$f":"$F$17","v":0},null,null,null,null,null,{"$f":"$F$17","v":0},null,{"$f":"$F$17","v":0},null,{"$f":"$F$17","v":0},null,{"$f":"$F$17","v":0}]
[]
[null,"CORE"]
[]
[null,"Core",null,{"$f":"IF(MCR!D17=\"\",\"\",MCR!D17)","v":""},null,{"$f":"Summary!D11","v":0},null,{"$f":"Summary!D13","v":1},null,0,null,{"$f":"IFERROR(J17*$H$17/$H17,0)","v":0},null,0,null,{"$f":"IFERROR(N17*$H$17/$H17,0)","v":0},null,null,null,"n/a",null,null,null,null,null,{"$f":"P17-SUM(Z21:Z234)","v":0},null,{"$f":"MIN(Z17,L17)","v":0},null,{"$f":"IF(AND($B17<>\"\",$L17=0),\"Infinite\",IF($B17=\"\",\"  -  \",$AB17/$L17))","v":"Infinite"}]
[]
[null,"CELLS",null,null,null,null,null,null,null,null,null,null,null,null,null,null,null,null,null,null,null,null,null,null,null,{"$f":"IF(AND(Z17<L17, Z17<P17),\"THE CORE CAPITAL CANNOT BE LESS THAN THE CORE'S NOTIONAL PCR, REDUCE CAPITAL ALLOCATED TO CELLS\",\"\")","v":""},null,null,null,null,null,null,"Risk Type",null,"Exch Rate"]
[]
[null,{"$f":"IF(MCR!B21=\"\",\"\",MCR!B21)","v":""},null,{"$f":"IF(MCR!D21=\"\",\"\",MCR!D21)","v":""},null,{"$f":"IF(MCR!F21=\"\",\"\",MCR!F21)","v":""},null,{"$f":"IF(MCR!H21=\"\",\"\",MCR!H21)","v":""},null,0,null,{"$f":"IFERROR(J21*$H$17/$H21,0)","v":0},null,0,null,{"$f":"IFERROR(N21*$H$17/$H21,0)","v":0},null,{"$f":"IF(AND($B21<>\"\",$L21=0),\"Infinite\",IF($B21=\"\",\"  -  \",$P21/$L21))","v":"  -  "},null,{"$f":"IF(MCR!T21=\"\",\"\",MCR!T21)","v":""},null,{"$f":"MIN(L21,P21)","v":0},null,{"$f":"P21-V21","v":0},null,0,null,{"$f":"V21+Z21","v":0},null,{"$f":"IF(AND($B21<>\"\",$L21=0),\"Infinite\",IF($B21=\"\",\"  -  \",$AB21/$L21))","v":"  -  "},null,null,{"$f":"IF(OR(AND(Summary!$D$15=\"General Business\",PCR!D21=\"LB\"),AND(Summary!$D$15=\"Long Term Business\",PCR!D21=\"GB\")),\"ERROR\",\"\")","v":""},null,{"$f":"IF(OR(AND(F21<>\"\",H21=\"\"),AND(F21=\"GBP\",H21<>1), AND(F21<>\"GBP\",H21=1)),\"ERROR\",\"\")","v":""}]
[null,{"$f":"IF(MCR!B22=\"\",\"\",MCR!B22)","v":""},null,{"$f":"IF(MCR!D22=\"\",\"\",MCR!D22)","v":""},null,{"$f":"IF(MCR!F22=\"\",\"\",MCR!F22)","v":""},null,{"$f":"IF(MCR!H22=\"\",\"\",MCR!H22)","v":""},null,0,null,0,null,0,null,{"$f":"IFERROR(N22*$H$17/$H22,0)","v":0},null,{"$f":"IF(AND($B22<>\"\",$L22=0),\"Infinite\",IF($B22=\"\",\"  -  \",$P22/$L22))","v":"  -  "},null,{"$f":"IF(MCR!T22=\"\",\"\",MCR!T22)","v":""},null,{"$f":"MIN(L22,P22)","v":0},null,{"$f":"P22-V22","v":0},null,0,null,0,null,"  -  ",null,null,{"$f":"IF(OR(AND(Summary!$D$15=\"General Business\",PCR!D22=\"LB\"),AND(Summary!$D$15=\"Long Term Business\",PCR!D22=\"GB\")),\"ERROR\",\"\")","v":""},null,""]
[null,{"$f":"IF(MCR!B23=\"\",\"\",MCR!B23)","v":""},null,{"$f":"IF(MCR!D23=\"\",\"\",MCR!D23)","v":""},null,{"$f":"IF(MCR!F23=\"\",\"\",MCR!F23)","v":""},null,{"$f":"IF(MCR!H23=\"\",\"\",MCR!H23)","v":""},null,0,null,0,null,0,null,0,null,"  -  ",null,{"$f":"IF(MCR!T23=\"\",\"\",MCR!T23)","v":""},null,0,null,0,null,0,null,0,null,"  -  ",null,null,{"$f":"IF(OR(AND(Summary!$D$15=\"General Business\",PCR!D23=\"LB\"),AND(Summary!$D$15=\"Long Term Business\",PCR!D23=\"GB\")),\"ERROR\",\"\")","v":""},null,""]
[null,{"$f":"IF(MCR!B24=\"\",\"\",MCR!B24)","v":""},null,{"$f":"IF(MCR!D24=\"\",\"\",MCR!D24)","v":""},null,{"$f":"IF(MCR!F24=\"\",\"\",MCR!F24)","v":""},null,{"$f":"IF(MCR!H24=\"\",\"\",MCR!H24)","v":""},null,0,null,0,null,0,null,0,null,"  -  ",null,{"$f":"IF(MCR!T24=\"\",\"\",MCR!T24)","v":""},null,0,null,0,null,0,null,0,null,"  -  ",null,null,{"$f":"IF(OR(AND(Summary!$D$15=\"General Business\",PCR!D24=\"LB\"),AND(Summary!$D$15=\"Long Term Business\",PCR!D24=\"GB\")),\"ERROR\",\"\")","v":""},null,""]
[null,{"$f":"IF(MCR!B25=\"\",\"\",MCR!B25)","v":""},null,{"$f":"IF(MCR!D25=\"\",\"\",MCR!D25)","v":""},null,{"$f":"IF(MCR!F25=\"\",\"\",MCR!F25)","v":""},null,{"$f":"IF(MCR!H25=\"\",\"\",MCR!H25)","v":""},null,0,null,0,null,0,null,0,null,"  -  ",null,{"$f":"IF(MCR!T25=\"\",\"\",MCR!T25)","v":""},null,0,null,0,null,0,null,0,null,"  -  ",null,null,{"$f":"IF(OR(AND(Summary!$D$15=\"General Business\",PCR!D25=\"LB\"),AND(Summary!$D$15=\"Long Term Business\",PCR!D25=\"GB\")),\"ERROR\",\"\")","v":""},null,""]
[null,{"$f":"IF(MCR!B26=\"\",\"\",MCR!B26)","v":""},null,{"$f":"IF(MCR!D26=\"\",\"\",MCR!D26)","v":""},null,{"$f":"IF(MCR!F26=\"\",\"\",MCR!F26)","v":""},null,{"$f":"IF(MCR!H26=\"\",\"\",MCR!H26)","v":""},null,0,null,0,null,0,null,0,null,"  -  ",null,{"$f":"IF(MCR!T26=\"\",\"\",MCR!T26)","v":""},null,0,null,0,null,0,null,0,null,"  -  ",null,null,{"$f":"IF(OR(AND(Summary!$D$15=\"General Business\",PCR!D26=\"LB\"),AND(Summary!$D$15=\"Long Term Business\",PCR!D26=\"GB\")),\"ERROR\",\"\")","v":""},null,""]
[null,{"$f":"IF(MCR!B27=\"\",\"\",MCR!B27)","v":""},null,{"$f":"IF(MCR!D27=\"\",\"\",MCR!D27)","v":""},null,{"$f":"IF(MCR!F27=\"\",\"\",MCR!F27)","v":""},null,{"$f":"IF(MCR!H27=\"\",\"\",MCR!H27)","v":""},null,0,null,0,null,0,null,0,null,"  -  ",null,{"$f":"IF(MCR!T27=\"\",\"\",MCR!T27)","v":""},null,0,null,0,null,0,null,0,null,"  -  ",null,null,{"$f":"IF(OR(AND(Summary!$D$15=\"General Business\",PCR!D27=\"LB\"),AND(Summary!$D$15=\"Long Term Business\",PCR!D27=\"GB\")),\"ERROR\",\"\")","v":""},null,""]
[null,{"$f":"IF(MCR!B28=\"\",\"\",MCR!B28)","v":""},null,{"$f":"IF(MCR!D28=\"\",\"\",MCR!D28)","v":""},null,{"$f":"IF(MCR!F28=\"\",\"\",MCR!F28)","v":""},null,{"$f":"IF(MCR!H28=\"\",\"\",MCR!H28)","v":""},null,0,null,0,null,0,null,0,null,"  -  ",null,{"$f":"IF(MCR!T28=\"\",\"\",MCR!T28)","v":""},null,0,null,0,null,0,null,0,null,"  -  ",null,null,{"$f":"IF(OR(AND(Summary!$D$15=\"General Business\",PCR!D28=\"LB\"),AND(Summary!$D$15=\"Long Term Business\",PCR!D28=\"GB\")),\"ERROR\",\"\")","v":""},null,""]
[null,{"$f":"IF(MCR!B29=\"\",\"\",MCR!B29)","v":""},null,{"$f":"IF(MCR!D29=\"\",\"\",MCR!D29)","v":""},null,{"$f":"IF(MCR!F29=\"\",\"\",MCR!F29)","v":""},null,{"$f":"IF(MCR!H29=\"\",\"\",MCR!H29)","v":""},null,0,null,0,null,0,null,0,null,"  -  ",null,{"$f":"IF(MCR!T29=\"\",\"\",MCR!T29)","v":""},null,0,null,0,null,0,null,0,null,"  -  ",null,null,{"$f":"IF(OR(AND(Summary!$D$15=\"General Business\",PCR!D29=\"LB\"),AND(Summary!$D$15=\"Long Term Business\",PCR!D29=\"GB\")),\"ERROR\",\"\")","v":""},null,""]
[null,{"$f":"IF(MCR!B30=\"\",\"\",MCR!B30)","v":""},null,{"$f":"IF(MCR!D30=\"\",\"\",MCR!D30)","v":""},null,{"$f":"IF(MCR!F30=\"\",\"\",MCR!F30)","v":""},null,{"$f":"IF(MCR!H30=\"\",\"\",MCR!H30)","v":""},null,0,null,0,null,0,null,0,null,"  -  ",null,{"$f":"IF(MCR!T30=\"\",\"\",MCR!T30)","v":""},null,0,null,0,null,0,null,0,null,"  -  ",null,null,{"$f":"IF(OR(AND(Summary!$D$15=\"General Business\",PCR!D30=\"LB\"),AND(Summary!$D$15=\"Long Term Business\",PCR!D30=\"GB\")),\"ERROR\",\"\")","v":""},null,""]
{"$rows_left_out":206}
{"sheet":"Factors","index":5,"n_rows":76,"n_cols":7,"rows_kept":76,"cut":false,"hidden":false,"merged":[]}
[]
[]
[null,"United Kingdom Pounds","GBP",null,null,"GBP","Reporting FX"]
[null,"Euro","EUR",null,"General Business",100000,{"$f":"F4*Summary!$D$13","v":100000}]
[null,"United States Dollars","USD",null,"Long Term Business",250000,{"$f":"F5*Summary!$D$13","v":250000}]
[null,"Sweden Kronor","SEK",null,"Composite",250000,{"$f":"F6*Summary!$D$13","v":250000}]
[null,"South Africa Rand","ZAR",null,"Selected",{"$f":"IFERROR(INDEX($F$4:$F$6,MATCH(Summary!$D$15,Factors!$E$4:$E$6,0),1),0)","v":0},{"$f":"IFERROR(INDEX($G$4:$G$6,MATCH(Summary!$D$15,Factors!$E$4:$E$6,0),1),0)","v":0}]
[null,"United Arab Emirates Dirhams","AED"]
[null,"Afghanistan Afghanis","AFN"]
[null,"Albania Leke","ALL"]
[null,"Argentina Pesos","ARS"]
[null,"Australia Dollars","AUD"]
[null,"Barbados Dollars","BBD"]
[null,"Bangladesh Taka","BDT"]
[null,"Bulgaria Leva","BGN"]
[null,"Bahrain Dinars","BHD"]
[null,"Bermuda Dollars","BMD"]
[null,"Brazil Reais","BRL"]
[null,"Bahamas Dollars","BSD"]
[null,"Canada Dollars","CAD"]
[null,"Switzerland Francs","CHF"]
[null,"Chile Pesos","CLP"]
[null,"China Yuan Renminbi","CNY"]
[null,"Colombia Pesos","COP"]
[null,"Costa Rica Colones","CRC"]
[null,"Czech Republic Koruny","CZK"]
[null,"Denmark Kroner","DKK"]
[null,"Dominican Republic Pesos","DOP"]
[null,"Algeria Dinars","DZD"]
[null,"Estonia Krooni","EEK"]
{"$rows_left_out":46}